Home > Browser Launch > Browser Launch Error 193 Java

Browser Launch Error 193 Java

So if your personal computer is already more mature than 5 years, it is actually hugely instructed that you choose to purchase a new one, which is if each of the To speak with an Oracle sales representative: 1.800.ORACLE1. Microsoft regularly releases patches and service packs for their operating methods that may well contain fixes for the cause of one's BSOD. We apologize for any inconvenience this may have caused. weblink

i think i need to have different node machines with these versions of web browsers installed there. Aarohi Hi Mukesh, I'm getting error as Cannot run program "D:\Selenium driver\chromedriver_mac32\chromedriver" (in directory "."): CreateProcess error=193, %1 is not a valid Win32 application). Windows will analyze the BSODs and other types of problems your laptop or computer has experienced prior to giving you any information it has about fixing the problem. Note: If you've made several customizations to your BIOS settings and don't wish to load the default ones then at least check out returning clock speed, voltage settings, and BIOS memory

Show Gunho Cho (Inactive) added a comment - 2013-03-05 17:37 Exact duplicate of 8007495 whose fix is ready and under code review. Skip to main content Download Getting Started Members Projects Community Marketplace Events Planet Eclipse Newsletter Videos Participate Report a Bug Forums Mailing Lists Wiki IRC How to Contribute Working Groups Automotive This cost-free place will permit your pc to have a area to the swap file to extend in measurement and in addition give extra place for short term data files. We are aware of the issue and are working as quick as possible to correct the issue.

I tried that but get an exception; (Oct 23, 2001 1:46:03 PM), , com.installshield.wizardx.actions.ExecWizardAction, err, java.io.IOException: CreateProcess: C:\TEMP\ismp006\blah.html error=193 STACK_TRACE: 11 java.io.IOException: CreateProcess: C:\TEMP\ismp006\blah.html error=193 at java.lang.Win32Process.create(Native Method) at java.lang.Win32Process.(Unknown Source) Note- Selenium Webdriver supports chrome latest version. Rememeber, these files are prefixed with a dot ".", so they are hidden. Any other suggestions to fix this issue?

Variable name is - webdriver.chrome.driver In Java to set variable we use setProperty method of System class so let us add the same in our program Sample Program for Launch Chrome Browser Deleting .snap solved the issue for my precious workspace too. Click to the System Restore program icon. Practically I tried and it works fine Program for Run Selenium Webdriver in chrome Browser package demotc; import org.openqa.selenium.WebDriver; import org.openqa.selenium.chrome.ChromeDriver; import org.testng.annotations.Test; public class Openchrome { @Test public void

Deleting .snap solved the issue for my precious workspace . To contact Oracle Corporate Headquarters from anywhere in the world: 1.650.506.7000. Smith,Donald Avondolio,W. To repair this issue, you might have to have the ability to initially discover and after that repair any on the troubles that your system could have.

at org.eclipse.core.internal.dtree.AbstractDataTree.handleNotFo und(AbstractDataTree.java:257) at org.eclipse.core.internal.dtree.DeltaDataTree.getData(DeltaD ataTree.java:585) at org.eclipse.core.internal.dtree.DataDeltaNode.asBackwardDelt a(DataDeltaNode.java:50) at org.eclipse.core.internal.dtree.DataDeltaNode.asBackwardDelt a(DataDeltaNode.java:47) at org.eclipse.core.internal.dtree.DeltaDataTree.asBackwardDelt a(DeltaDataTree.java:88) at org.eclipse.core.internal.dtree.DeltaDataTree.reroot(DeltaDa taTree.java:816) at org.eclipse.core.internal.dtree.DeltaDataTree.reroot(DeltaDa taTree.java:815) at org.eclipse.core.internal.dtree.DeltaDataTree.reroot(DeltaDa taTree.java:815) at org.eclipse.core.internal.dtree.DeltaDataTree.reroot(DeltaDa taTree.java:815) at org.eclipse.core.internal.dtree.DeltaDataTree.reroot(DeltaDa taTree.java:815) at In Unix, you must use the -a flag with ls to see them. On Joe's machine, getlasterror returns 193. Mukesh Otwani is it fixed Sara?

when i retry it same information popup is appearing and this time even in task manager also eclipse is not showing to kill...in this stage i have to restart my computer have a peek at these guys BootLoader constants: OS=win32, ARCH=x86, WS=win32, NL=en_US Command-line arguments: -os win32 -ws win32 -arch x86 !ENTRY org.eclipse.core.resources 2 10035 2009-10-17 12:08:07.589 !MESSAGE The workspace exited with unsaved changes in the previous session; err# 1314 is thrown when unauthorized user tries on CreateProcessAsUser() API. and it hangs right around the time when it's supposed to tell you which directory (workspace) u wanna use.

  • If i open a new workspace it is working fine, but I don't know how to import projects from my old workspace that is not working.
  • Manjunath Hi, In Case of Maven Project, We are adding dependencies.
  • Export the preferences from the good workspace you've painstakingly put together via File -> Export -> General -> Preferences.
  • i go to task manager and able to kill the eclipse..
  • As a matter of interest, what does the .snap file do?
  • public class Sep13 { public static void main(String[] args) { System.setProperty("webdriver.chrome.driver","C:\\Users\\naresh\\Downloads\\selenium-java-3.0.0-beta2\\chromedriver.exe"); WebDriver driver= new ChromeDriver driver.get("http://www.google.com"); driver.manage().window().maximize(); driver.getTitle(); Mukesh Otwani Can you try with Selenium 2.53.1 http://selenium-release.storage.googleapis.com/index.html Div_QueenBee (@bug_huntress) It worked
  • Your version of Blackboard displays at the …… A web browser (commonly referred to as a browser) is a software application for retrieving, presenting and traversing information resources on the World
  • Thanks in advance.

Browser Launch Error 193 Java 4 out of 5 based on 32 ratings. DacontaVista de fragmentos - 2003More Java Pitfalls: 50 New Time-Saving Solutions and WorkaroundsMichael C. If so, there's a very good chance that the change you made induced the BSOD. check over here Can you give a bit more detail on how to do this (an example would be good).

Had the same problem before! You can refer complete YouTube video Step 1: Download Chrome Drive Open any browser and open http://www.seleniumhq.org/download/ Here you will get third party driver section and you can get so i opened log.txt and this is what it said: eclipse.buildId=I20080617-2000 java.version=1.6.0-oem java.vendor=Sun Microsystems Inc.

instead it gives me that error message and tells me to look at the error log.

I tried deleting *.snap files below .metadata/.plugins/org.eclipse.core.resources and that did the trick. Thanks Peter! Show Paul Klingaman added a comment - 2013-03-13 07:30 Duplicated by JDK-8009516 . Try using a new workspace.

I usually advise Home windows users to keep at least 15% of a drive's capacity free at all times. Mukesh Otwani Hi Manjunath, In case of Chrome driver you can keep driver in resource folder then specify the path Gajendra Thanks Mukesh for your time and solution provided. Look Browser Launch Error 193 Java at Security options. this content Daconta,Kevin T.

The expected document would start with log files, possible corrupted user files to be deleted in some sort of order until it start OK or repair tool my be available, ... Clay RichardsonEdiciónilustradaEditorJohn Wiley & Sons, 2003ISBN0471467243, 9780471467243N.º de páginas480 páginas  Exportar citaBiBTeXEndNoteRefManAcerca de Google Libros - Política de privacidad - Condicionesdeservicio - Información para editores - Notificar un error - Ayuda - Link for driver- Get 25 version only https://chromedriver.storage.googleapis.com/index.html sharath Hi Mukesh, I am getting following error Exception in thread "main" org.openqa.selenium.SessionNotCreatedException: session not created exception from unknown error: Runtime.executionContextCreated has invalid An overclocked or misconfigured BIOS can cause all sorts of random problems, like BSODs.

I also tried to remove the "-vmargs" from eclipse.ini. Thanks indeed. Re-importing > the projects is the least of my problems. > I've tried restoring earlier versions of the workspace from backups, > going back days before the crash, but still Eclipse DACONTA is Director of Web and Technology Services for McDonald Bradley, Inc., where he develops advanced Java systems.

We have to download separate drivers and we have to specify the path as well with the location of the driver. Alex Report message to a moderator Re: error while opening eclipse [message #1186261 is a reply to message #1117879] Thu, 14 November 2013 15:39 Janusz CzemborMessages: 1Registered: November 2013 Report message to a moderator Re: error while opening eclipse [message #1446782 is a reply to message #1444783] Fri, 17 October 2014 09:50 Forrest CenskyMessages: 1Registered: October 2014 Junior Is there anything I can do to prevent a repeat of the problem?

at org.eclipse.osgi.framework.internal.core.BundleContextImpl.s tartActivator(BundleContextImpl.java:1028) at org.eclipse.osgi.framework.internal.core.BundleContextImpl.s tart(BundleContextImpl.java:984) at org.eclipse.osgi.framework.internal.core.BundleHost.startWor ker(BundleHost.java:346) at org.eclipse.osgi.framework.internal.core.AbstractBundle.star t(AbstractBundle.java:265) at org.eclipse.osgi.framework.util.SecureAction.start(SecureAct ion.java:400) at org.eclipse.core.runtime.internal.adaptor.EclipseLazyStarter .postFindLocalClass(EclipseLazyStarter.java:111) at org.eclipse.osgi.baseadaptor.loader.ClasspathManager.findLoc alClass(ClasspathManager.java:427) at org.eclipse.osgi.internal.baseadaptor.DefaultClassLoader.fin dLocalClass(DefaultClassLoader.java:193) at org.eclipse.osgi.framework.internal.core.BundleLoader.findLo calClass(BundleLoader.java:368) at org.eclipse.osgi.framework.internal.core.SingleSourcePackage .loadClass(SingleSourcePackage.java:33) at Hide Permalink Paul Klingaman added a comment - 2013-03-13 07:30 Duplicated by JDK-8009516. Clay RichardsonNo hay vista previa disponible - 2003More Java Pitfalls: 50 New Time-Saving Solutions and WorkaroundsMichael C. Exception in thread "main" org.openqa.selenium.WebDriverException: unknown error: cannot find Chrome binary Mukesh Otwani Hi, Kindly use chrome driver 2.25 version which will fix your issue.

Since it might be a complex task I am awaiting real expert advices. All Rights Reserved.